Reaction Details
TargetCoagulation factor X
LigandBDBM17642
Substrate/CompetitorBDBM17640
Meas. Tech.In Vitro Assay for Inhibition of Factor Xa
pH7.4±n/a
Temperature295.15±n/a K
Ki 11±5 nM
Citation Chan, CBorthwick, ADBrown, DBurns-Kurtis, CLCampbell, MChaudry, LChung, CWConvery, MAHamblin, JNJohnstone, LKelly, HAKleanthous, SPatikis, APatel, CPateman, AJSenger, SShah, GPToomey, JRWatson, NSWeston, HEWhitworth, CYoung, RJZhou, P Factor Xa inhibitors: S1 binding interactions of a series of N-{(3S)-1-[(1S)-1-methyl-2-morpholin-4-yl-2-oxoethyl]-2-oxopyrrolidin-3-yl}sulfonamides. J Med Chem50:1546-57 (2007) 
 
Coagulation factor X
Name:Coagulation factor X
Type:Enzyme
Mol. Mass.:54726.60
Organism:Homo sapiens (Human)
Description:n/a
Residue:488
BDBM17642
BDBM17640
NameBDBM17642
Synonyms:(E)-2-(4-chlorophenyl)-N-[(3S)-1-[(2S)-1-(morpholin-4-yl)-1-oxopropan-2-yl]-2-oxopyrrolidin-3-yl]ethene-1-sulfonamide | N-[(3S)-2-oxopyrrolidin-3-yl]sulfonamide, 1c
TypeSmall organic molecule
Emp. Form.C19H24ClN3O5S
Mol. Mass.441.929
SMILESC[C@H](N1CC[C@H](NS(=O)(=O)\C=C\c2ccc(Cl)cc2)C1=O)C(=O)N1CCOCC1