Reaction Details
TargetAndrogen receptor
LigandBDBM18172
Substrate/CompetitorBDBM18161
Meas. Tech.Receptor Binding and Transactivation Assay
pH7.4±n/a
Temperature295.15±n/a K
Ki 5.3±n/a nM
IC50 60±n/a nM
EC50 1298±n/a nM
CommentsIntrinsic relative activity to DHT is 49%.
Citation Sun, CRobl, JAWang, TCHuang, YKuhns, JELupisella, JABeehler, BCGolla, RSleph, PGSeethala, RFura, AKrystek, SrAn, YMalley, MFSack, JSSalvati, MEGrover, GJOstrowski, JHamann, LG Discovery of potent, orally-active, and muscle-selective androgen receptor modulators based on an N-aryl-hydroxybicyclohydantoin scaffold. J Med Chem49:7596-9 (2006) 
 
Androgen receptor
Name:Androgen receptor
Type:Receptor
Mol. Mass.:99185.27
Organism:Homo sapiens (Human)
Description:CHO cells were stably transfected with human AR gene.
Residue:920
BDBM18172
BDBM18161
NameBDBM18172
Synonyms:4-[(7S,7aR)-7-hydroxy-1,3-dioxo-hexahydro-1H-pyrrolo[1,2-a]imidazolidin-2-yl]naphthalene-1-carbonitrile | N-aryl-bicyclic hydantoin, (+)10b
TypeSmall organic molecule
Emp. Form.C17H13N3O3
Mol. Mass.307.3034
SMILESO[C@H]1CCn2c1c(O)n(-c1ccc(C#N)c3ccccc13)c2=O