Reaction Details
TargetAndrogen receptor
LigandBDBM18171
Substrate/CompetitorBDBM18161
Meas. Tech.Receptor Binding and Transactivation Assay
pH7.4±n/a
Temperature295.15±n/a K
Ki 3.2±n/a nM
EC50 2.3±n/a nM
CommentsCompound is full agonist with IA>85% relative to DHT control (IA=100%)
Citation Li, JJSutton, JCNirschl, AZou, YWang, HSun, CPi, ZJohnson, RKrystek, SRSeethala, RGolla, RSleph, PGBeehler, BCGrover, GJFura, AVyas, VPLi, CYGougoutas, JZGalella, MAZahler, ROstrowski, JHamann, LG Discovery of Potent and Muscle Selective Androgen Receptor Modulators through Scaffold Modifications. J Med Chem50:3015-3025 (2007) 
 
Androgen receptor
Name:Androgen receptor
Type:Receptor
Mol. Mass.:99185.27
Organism:Homo sapiens (Human)
Description:CHO cells were stably transfected with human AR gene.
Residue:920
BDBM18171
BDBM18161
NameBDBM18171
Synonyms:4-[(7R,7aS)-7-hydroxy-1,3-dioxo-hexahydro-1H-pyrrolo[1,2-a]imidazolidin-2-yl]naphthalene-1-carbonitrile N-aryl-bicyclic hydantoin, (-)10b | hydantoin, 7
TypeSmall organic molecule
Emp. Form.C17H13N3O3
Mol. Mass.307.3034
SMILESO[C@@H]1CCn2c1c(O)n(-c1ccc(C#N)c3ccccc13)c2=O