Reaction Details
TargetAndrogen receptor
LigandBDBM18174
Substrate/CompetitorBDBM18161
Meas. Tech.Receptor Binding and Transactivation Assay
pH7.4±n/a
Temperature295.15±n/a K
Ki 2.0±n/a nM
EC50 15±n/a nM
CommentsCompound is full agonist with IA>85% relative to DHT control (IA=100%)
Citation Li, JJSutton, JCNirschl, AZou, YWang, HSun, CPi, ZJohnson, RKrystek, SRSeethala, RGolla, RSleph, PGBeehler, BCGrover, GJFura, AVyas, VPLi, CYGougoutas, JZGalella, MAZahler, ROstrowski, JHamann, LG Discovery of Potent and Muscle Selective Androgen Receptor Modulators through Scaffold Modifications. J Med Chem50:3015-3025 (2007) 
 
Androgen receptor
Name:Androgen receptor
Type:Receptor
Mol. Mass.:99185.27
Organism:Homo sapiens (Human)
Description:CHO cells were stably transfected with human AR gene.
Residue:920
BDBM18174
BDBM18161
NameBDBM18174
Synonyms:4-[(7R,7aR)-7-hydroxy-3-oxo-hexahydro-1H-pyrrolo[1,2-a]imidazolidin-2-yl]-2-chloro-3-methylbenzonitrile imidazolin-2-one, 8
TypeSmall organic molecule
Emp. Form.C14H14ClN3O2
Mol. Mass.291.733
SMILES[H][C@]12CN(C(=O)N1CC[C@H]2O)c1ccc(C#N)c(Cl)c1C