Reaction Details
TargetAndrogen receptor
LigandBDBM18178
Substrate/CompetitorBDBM18161
Meas. Tech.Receptor Binding and Transactivation Assay
pH7.4±n/a
Temperature295.15±n/a K
Ki 0.9±n/a nM
EC50 2.5±n/a nM
CommentsCompound is full agonist with IA>85% relative to DHT control (IA=100%)
Citation Li, JJSutton, JCNirschl, AZou, YWang, HSun, CPi, ZJohnson, RKrystek, SRSeethala, RGolla, RSleph, PGBeehler, BCGrover, GJFura, AVyas, VPLi, CYGougoutas, JZGalella, MAZahler, ROstrowski, JHamann, LG Discovery of Potent and Muscle Selective Androgen Receptor Modulators through Scaffold Modifications. J Med Chem50:3015-3025 (2007) 
 
Androgen receptor
Name:Androgen receptor
Type:Receptor
Mol. Mass.:99185.27
Organism:Homo sapiens (Human)
Description:CHO cells were stably transfected with human AR gene.
Residue:920
BDBM18178
BDBM18161
NameBDBM18178
Synonyms:4-[(1R,7S,7aR)-7-hydroxy-3-oxo-1-(trifluoromethyl)-hexahydro-1H-pyrrolo[1,2-a]imidazolidin-2-yl]-2-chloro-3-methylbenzonitrile | imidazolin-2-one, 12a
TypeSmall organic molecule
Emp. Form.C15H13ClF3N3O2
Mol. Mass.359.731
SMILES[H][C@@]12[C@@H](O)CCN1C(=O)N([C@H]2C(F)(F)F)c1ccc(C#N)c(Cl)c1C