Reaction Details
TargetPhosphatidylinositol 4,5-bisphosphate 3-kinase catalytic subunit delta isoform
LigandBDBM50232456
Substrate/Competitorn/a
Meas. Tech.ADP-Glo Format PI3K Assay
IC50 1.000±n/a nM
Citation Bhide, RSBatt, DGCherney, RJCornelius, LALiu, QMarcoux, DNeels, JPoss, MARuan, ZShi, QSrivastava, ASQin, LTino, JAWatterson, SH Bicyclic heteroaryl amine compounds US Patent US10214537 Publication Date 2/26/2019
 
Phosphatidylinositol 4,5-bisphosphate 3-kinase catalytic subunit delta isoform
Name:Phosphatidylinositol 4,5-bisphosphate 3-kinase catalytic subunit delta isoform
Type:Enzyme Subunit
Mol. Mass.:119489.41
Organism:Homo sapiens (Human)
Description:O00329
Residue:1044
BDBM50232456
NameBDBM50232456
Synonyms:CHEMBL4090888 | US10214537, Example 289
TypeSmall organic molecule
Emp. Form.C27H32N8O2
Mol. Mass.500.5954
SMILESNc1ncnn2c(cc(-c3ccnn3C3CCOCC3)c12)-c1cccc(c1)N1CCN(CC1)C1COC1