Reaction Details
TargetPhosphatidylinositol 4,5-bisphosphate 3-kinase catalytic subunit delta isoform
LigandBDBM50239739
Substrate/Competitorn/a
Meas. Tech.ADP-Glo Format PI3K Assay
IC50 2.00±n/a nM
Citation Bhide, RSBatt, DGCherney, RJCornelius, LALiu, QMarcoux, DNeels, JPoss, MARuan, ZShi, QSrivastava, ASQin, LTino, JAWatterson, SH Bicyclic heteroaryl amine compounds US Patent US10214537 Publication Date 2/26/2019
 
Phosphatidylinositol 4,5-bisphosphate 3-kinase catalytic subunit delta isoform
Name:Phosphatidylinositol 4,5-bisphosphate 3-kinase catalytic subunit delta isoform
Type:Enzyme Subunit
Mol. Mass.:119489.41
Organism:Homo sapiens (Human)
Description:O00329
Residue:1044
BDBM50239739
NameBDBM50239739
Synonyms:CHEMBL4073255 | US10214537, Example 629
TypeSmall organic molecule
Emp. Form.C22H23F3N6O4S
Mol. Mass.524.516
SMILESCC(=O)N1CCN(C(=O)C1(C)C)c1cc(ccc1S(C)(=O)=O)-c1cc(c2c(N)ncnn12)C(F)(F)F