Reaction Details
TargetPhosphatidylinositol 4,5-bisphosphate 3-kinase catalytic subunit delta isoform
LigandBDBM358600
Substrate/Competitorn/a
Meas. Tech.ADP-Glo Format PI3K Assay
IC50 0.200±n/a nM
Citation Bhide, RSBatt, DGCherney, RJCornelius, LALiu, QMarcoux, DNeels, JPoss, MARuan, ZShi, QSrivastava, ASQin, LTino, JAWatterson, SH Bicyclic heteroaryl amine compounds US Patent US10214537 Publication Date 2/26/2019
 
Phosphatidylinositol 4,5-bisphosphate 3-kinase catalytic subunit delta isoform
Name:Phosphatidylinositol 4,5-bisphosphate 3-kinase catalytic subunit delta isoform
Type:Enzyme Subunit
Mol. Mass.:119489.41
Organism:Homo sapiens (Human)
Description:O00329
Residue:1044
BDBM358600
NameBDBM358600
Synonyms:(S)-4-acetyl-1-(5-(4-amino-5- (trifluoromethyl)pyrrolo[2,1-f][1,2,4] triazin-7-yl)-2-fluorophenyl)-3,3,6- trimethylpiperazin-2-one | US10214537, Example 677
TypeSmall organic molecule
Emp. Form.C22H22F4N6O2
Mol. Mass.478.4427
SMILESC[C@H]1CN(C(C)=O)C(C)(C)C(=O)N1c1cc(ccc1F)-c1cc(c2c(N)ncnn12)C(F)(F)F