Reaction Details
TargetPhosphatidylinositol 4,5-bisphosphate 3-kinase catalytic subunit delta isoform
LigandBDBM358610
Substrate/Competitorn/a
Meas. Tech.ADP-Glo Format PI3K Assay
IC50 0.200±n/a nM
Citation Bhide, RSBatt, DGCherney, RJCornelius, LALiu, QMarcoux, DNeels, JPoss, MARuan, ZShi, QSrivastava, ASQin, LTino, JAWatterson, SH Bicyclic heteroaryl amine compounds US Patent US10214537 Publication Date 2/26/2019
 
Phosphatidylinositol 4,5-bisphosphate 3-kinase catalytic subunit delta isoform
Name:Phosphatidylinositol 4,5-bisphosphate 3-kinase catalytic subunit delta isoform
Type:Enzyme Subunit
Mol. Mass.:119489.41
Organism:Homo sapiens (Human)
Description:O00329
Residue:1044
BDBM358610
NameBDBM358610
Synonyms:(R)-2-(4-acetyl-3-ethyl-3-methyl-2- oxopiperazin-1-yl)-4-(4-amino-5- chloropyrrolo[2,1-f][1,2,4]triazin-7- yl)benzonitrile | US10214537, Example 687
TypeSmall organic molecule
Emp. Form.C22H22ClN7O2
Mol. Mass.451.909
SMILESCC[C@@]1(C)N(CCN(C1=O)c1cc(ccc1C#N)-c1cc(Cl)c2c(N)ncnn12)C(C)=O