Reaction Details
TargetPhosphatidylinositol 4,5-bisphosphate 3-kinase catalytic subunit delta isoform
LigandBDBM358628
Substrate/Competitorn/a
Meas. Tech.ADP-Glo Format PI3K Assay
IC50 3.00±n/a nM
Citation Bhide, RSBatt, DGCherney, RJCornelius, LALiu, QMarcoux, DNeels, JPoss, MARuan, ZShi, QSrivastava, ASQin, LTino, JAWatterson, SH Bicyclic heteroaryl amine compounds US Patent US10214537 Publication Date 2/26/2019
 
Phosphatidylinositol 4,5-bisphosphate 3-kinase catalytic subunit delta isoform
Name:Phosphatidylinositol 4,5-bisphosphate 3-kinase catalytic subunit delta isoform
Type:Enzyme Subunit
Mol. Mass.:119489.41
Organism:Homo sapiens (Human)
Description:O00329
Residue:1044
BDBM358628
NameBDBM358628
Synonyms:4-(4-amino-5-chloropyrrolo[2,1-f] [1,2,4]triazin-7-yl)-2-(2,2-dimethyl-5- (methyl-d3)-3-oxomorpholino-5,6,6-d3) benzonitrile US10214537, Example 707
TypeSmall organic molecule
Emp. Form.C20H19ClN6O2
Mol. Mass.410.857
SMILESCC1COC(C)(C)C(=O)N1c1cc(ccc1C#N)-c1cc(Cl)c2c(N)ncnn12