Reaction Details
TargetPhosphatidylinositol 4,5-bisphosphate 3-kinase catalytic subunit delta isoform
LigandBDBM358666
Substrate/Competitorn/a
Meas. Tech.ADP-Glo Format PI3K Assay
IC50 0.400±n/a nM
Citation Bhide, RSBatt, DGCherney, RJCornelius, LALiu, QMarcoux, DNeels, JPoss, MARuan, ZShi, QSrivastava, ASQin, LTino, JAWatterson, SH Bicyclic heteroaryl amine compounds US Patent US10214537 Publication Date 2/26/2019
 
Phosphatidylinositol 4,5-bisphosphate 3-kinase catalytic subunit delta isoform
Name:Phosphatidylinositol 4,5-bisphosphate 3-kinase catalytic subunit delta isoform
Type:Enzyme Subunit
Mol. Mass.:119489.41
Organism:Homo sapiens (Human)
Description:O00329
Residue:1044
BDBM358666
NameBDBM358666
Synonyms:4-(4-amino-5-chloropyrrolo[2,1-f] [1,2,4]triazin-7-yl)-2-(4-(2-(1,1- dioxido-1,2-thiazinan-2-yl)acetyl)-3,3- dimethyl-2-oxopiperazin-1- yl)benzonitrile | US10214537, Example 743
TypeSmall organic molecule
Emp. Form.C25H27ClN8O4S
Mol. Mass.571.051
SMILESCC1(C)N(CCN(C1=O)c1cc(ccc1C#N)-c1cc(Cl)c2c(N)ncnn12)C(=O)CN1CCCCS1(=O)=O