Reaction Details
TargetPhosphatidylinositol 4,5-bisphosphate 3-kinase catalytic subunit delta isoform
LigandBDBM358669
Substrate/Competitorn/a
Meas. Tech.ADP-Glo Format PI3K Assay
IC50 0.400±n/a nM
Citation Bhide, RSBatt, DGCherney, RJCornelius, LALiu, QMarcoux, DNeels, JPoss, MARuan, ZShi, QSrivastava, ASQin, LTino, JAWatterson, SH Bicyclic heteroaryl amine compounds US Patent US10214537 Publication Date 2/26/2019
 
Phosphatidylinositol 4,5-bisphosphate 3-kinase catalytic subunit delta isoform
Name:Phosphatidylinositol 4,5-bisphosphate 3-kinase catalytic subunit delta isoform
Type:Enzyme Subunit
Mol. Mass.:119489.41
Organism:Homo sapiens (Human)
Description:O00329
Residue:1044
BDBM358669
NameBDBM358669
Synonyms:1-(3-(4-amino-5-chloropyrrolo[2,1-f] [1,2,4]triazin-7-yl)phenyl)-3,3- dimethyl-4-(2-(2-oxopyrrolidin-1- yl)acetyl)piperazin-2-one | US10214537, Example 746
TypeSmall organic molecule
Emp. Form.C24H26ClN7O3
Mol. Mass.495.961
SMILESCC1(C)N(CCN(C1=O)c1cccc(c1)-c1cc(Cl)c2c(N)ncnn12)C(=O)CN1CCCC1=O