Reaction Details
TargetPhosphatidylinositol 4,5-bisphosphate 3-kinase catalytic subunit delta isoform
LigandBDBM358685
Substrate/Competitorn/a
Meas. Tech.ADP-Glo Format PI3K Assay
IC50 0.500±n/a nM
Citation Bhide, RSBatt, DGCherney, RJCornelius, LALiu, QMarcoux, DNeels, JPoss, MARuan, ZShi, QSrivastava, ASQin, LTino, JAWatterson, SH Bicyclic heteroaryl amine compounds US Patent US10214537 Publication Date 2/26/2019
 
Phosphatidylinositol 4,5-bisphosphate 3-kinase catalytic subunit delta isoform
Name:Phosphatidylinositol 4,5-bisphosphate 3-kinase catalytic subunit delta isoform
Type:Enzyme Subunit
Mol. Mass.:119489.41
Organism:Homo sapiens (Human)
Description:O00329
Residue:1044
BDBM358685
NameBDBM358685
Synonyms:(S)-4-(4-amino-5-chloropyrrolo[2,1-f] [1,2,4]triazin-7-yl)-2-(3,3,6-trimethyl- 4-(2-(methylsulfonyl)acetyl)-2- oxopiperazin-1-yl)benzonitrile | US10214537, Example 763
TypeSmall organic molecule
Emp. Form.C23H24ClN7O4S
Mol. Mass.529.999
SMILESC[C@H]1CN(C(=O)CS(C)(=O)=O)C(C)(C)C(=O)N1c1cc(ccc1C#N)-c1cc(Cl)c2c(N)ncnn12