Reaction Details
TargetPhosphatidylinositol 4,5-bisphosphate 3-kinase catalytic subunit delta isoform
LigandBDBM358687
Substrate/Competitorn/a
Meas. Tech.ADP-Glo Format PI3K Assay
IC50 0.400±n/a nM
Citation Bhide, RSBatt, DGCherney, RJCornelius, LALiu, QMarcoux, DNeels, JPoss, MARuan, ZShi, QSrivastava, ASQin, LTino, JAWatterson, SH Bicyclic heteroaryl amine compounds US Patent US10214537 Publication Date 2/26/2019
 
Phosphatidylinositol 4,5-bisphosphate 3-kinase catalytic subunit delta isoform
Name:Phosphatidylinositol 4,5-bisphosphate 3-kinase catalytic subunit delta isoform
Type:Enzyme Subunit
Mol. Mass.:119489.41
Organism:Homo sapiens (Human)
Description:O00329
Residue:1044
BDBM358687
NameBDBM358687
Synonyms:4-(4-amino-5-(trifluoromethyl)pyrrolo [2,1-f][1,2,4]triazin-7-yl)-2-(4-(2-(4,4- dimethyl-2-oxopyrrolidin-1-yl)acetyl)- 3,3-dimethyl-2-oxopiperaizn-1- yl)benzonitrile | US10214537, Example 765
TypeSmall organic molecule
Emp. Form.C28H29F3N8O3
Mol. Mass.582.5769
SMILESCC1(C)CN(CC(=O)N2CCN(C(=O)C2(C)C)c2cc(ccc2C#N)-c2cc(c3c(N)ncnn23)C(F)(F)F)C(=O)C1