Reaction Details
TargetPhosphatidylinositol 4,5-bisphosphate 3-kinase catalytic subunit delta isoform
LigandBDBM358691
Substrate/Competitorn/a
Meas. Tech.ADP-Glo Format PI3K Assay
IC50 0.200±n/a nM
Citation Bhide, RSBatt, DGCherney, RJCornelius, LALiu, QMarcoux, DNeels, JPoss, MARuan, ZShi, QSrivastava, ASQin, LTino, JAWatterson, SH Bicyclic heteroaryl amine compounds US Patent US10214537 Publication Date 2/26/2019
 
Phosphatidylinositol 4,5-bisphosphate 3-kinase catalytic subunit delta isoform
Name:Phosphatidylinositol 4,5-bisphosphate 3-kinase catalytic subunit delta isoform
Type:Enzyme Subunit
Mol. Mass.:119489.41
Organism:Homo sapiens (Human)
Description:O00329
Residue:1044
BDBM358691
NameBDBM358691
Synonyms:(S)-1-(5-(4-amino-5-chloropyrrolo [2,1-f][1,2,4]triazin-7-yl)-2- fluorophenyl)-3,3,6-trimethyl-4-(2- (methylsulfonyl)acetyl)piperazin-2-one | US10214537, Example 769
TypeSmall organic molecule
Emp. Form.C22H24ClFN6O4S
Mol. Mass.522.98
SMILESC[C@H]1CN(C(=O)CS(C)(=O)=O)C(C)(C)C(=O)N1c1cc(ccc1F)-c1cc(Cl)c2c(N)ncnn12