Reaction Details
TargetPhosphatidylinositol 4,5-bisphosphate 3-kinase catalytic subunit delta isoform
LigandBDBM358754
Substrate/Competitorn/a
Meas. Tech.ADP-Glo Format PI3K Assay
IC50 0.700±n/a nM
Citation Bhide, RSBatt, DGCherney, RJCornelius, LALiu, QMarcoux, DNeels, JPoss, MARuan, ZShi, QSrivastava, ASQin, LTino, JAWatterson, SH Bicyclic heteroaryl amine compounds US Patent US10214537 Publication Date 2/26/2019
 
Phosphatidylinositol 4,5-bisphosphate 3-kinase catalytic subunit delta isoform
Name:Phosphatidylinositol 4,5-bisphosphate 3-kinase catalytic subunit delta isoform
Type:Enzyme Subunit
Mol. Mass.:119489.41
Organism:Homo sapiens (Human)
Description:O00329
Residue:1044
BDBM358754
NameBDBM358754
Synonyms:4-acetyl-1-(3-(4-amino-5-chloro-6- fluoropyrrolo[2,1-f][1,2,4]triaizn-7-yl)- 2-fluorophenyl)-3,3- dimethylpiperazin-2-one-5,5,6,6-d4 | US10214537, Example 833
TypeSmall organic molecule
Emp. Form.C20H19ClF2N6O2
Mol. Mass.448.854
SMILESCC(=O)N1CCN(C(=O)C1(C)C)c1cccc(-c2c(F)c(Cl)c3c(N)ncnn23)c1F