Reaction Details
TargetProtein-lysine 6-oxidase
LigandBDBM18355
Substrate/CompetitorBDBM18365
Meas. Tech.In Vitro Enzyme Inhibition
pH4.5±n/a
Temperature310.15±n/a K
IC50 5000±n/a nM
Citation Yu, LIkeda, KKato, AAdachi, IGodin, GCompain, PMartin, OAsano, N Alpha-1-C-octyl-1-deoxynojirimycin as a pharmacological chaperone for Gaucher disease. Bioorg Med Chem14:7736-44 (2006) 
 
Protein-lysine 6-oxidase
Name:Protein-lysine 6-oxidase
Type:PROTEIN
Mol. Mass.:46954.13
Organism:Homo sapiens (Human)
Description:ChEMBL_306619
Residue:417
BDBM18355
BDBM18365
NameBDBM18355
Synonyms:(2R,3R,4R,5S)-1-butyl-2-(hydroxymethyl)piperidine-3,4,5-triol MIGLUSTAT US20230339856, Compound NB-DNJ | US9181184, 5
TypeSmall organic molecule
Emp. Form.C10H21NO4
Mol. Mass.219.278
SMILESCCCCN1C[C@H](O)[C@@H](O)[C@H](O)[C@H]1CO