Reaction Details
TargetAndrogen receptor
LigandBDBM18543
Substrate/CompetitorBDBM18161
Meas. Tech.AR Transcriptional Activation Assay and MDA Whole-Cell Binding Assay
pH7.4±n/a
Temperature310.15±n/a K
Ki 50±7 nM
IC50 67±11 nM
CommentshAR antagonist efficacy = 86 +/- 2 %.
Citation van Oeveren, APio, BATegley, CMHiguchi, RIWu, MJones, TKMarschke, KBNegro-Vilar, AZhi, L Discovery of an androgen receptor modulator pharmacophore based on 2-quinolinones. Bioorg Med Chem Lett17:1523-6 (2007) 
 
Androgen receptor
Name:Androgen receptor
Type:Receptor
Mol. Mass.:99185.27
Organism:Homo sapiens (Human)
Description:CHO cells were stably transfected with human AR gene.
Residue:920
BDBM18543
BDBM18161
NameBDBM18543
Synonyms:7-(butylamino)-4-(trifluoromethyl)-1,2-dihydroquinolin-2-one | alkylamino-2-quinolinone, 9c
TypeSmall organic molecule
Emp. Form.C14H15F3N2O
Mol. Mass.284.2769
SMILESCCCCNc1ccc2c(cc(=O)[nH]c2c1)C(F)(F)F