Reaction Details
TargetAndrogen receptor
LigandBDBM18557
Substrate/CompetitorBDBM18161
Meas. Tech.AR Transcriptional Activation Assay and MDA Whole-Cell Binding Assay
pH7.4±n/a
Temperature310.15±n/a K
Ki 30±n/a nM
IC50 42±n/a nM
CommentshAR antagonist efficacy = 79 %.
Citation van Oeveren, APio, BATegley, CMHiguchi, RIWu, MJones, TKMarschke, KBNegro-Vilar, AZhi, L Discovery of an androgen receptor modulator pharmacophore based on 2-quinolinones. Bioorg Med Chem Lett17:1523-6 (2007) 
 
Androgen receptor
Name:Androgen receptor
Type:Receptor
Mol. Mass.:99185.27
Organism:Homo sapiens (Human)
Description:CHO cells were stably transfected with human AR gene.
Residue:920
BDBM18557
BDBM18161
NameBDBM18557
Synonyms:7-[ethyl(2,2,2-trifluoroethyl)amino]-4-(trifluoromethyl)-1,2-dihydroquinolin-2-one | alkylamino-2-quinolinone, 10c
TypeSmall organic molecule
Emp. Form.C14H12F6N2O
Mol. Mass.338.2483
SMILESCCN(CC(F)(F)F)c1ccc2c(cc(=O)[nH]c2c1)C(F)(F)F