Reaction Details
TargetAndrogen receptor
LigandBDBM18559
Substrate/CompetitorBDBM18161
Meas. Tech.AR Transcriptional Activation Assay and MDA Whole-Cell Binding Assay
Ki 30±n/a nM
IC50 76±n/a nM
Citation van Oeveren, APio, BATegley, CMHiguchi, RIWu, MJones, TKMarschke, KBNegro-Vilar, AZhi, L Discovery of an androgen receptor modulator pharmacophore based on 2-quinolinones. Bioorg Med Chem Lett17:1523-6 (2007) 
 
Androgen receptor
Name:Androgen receptor
Type:Receptor
Mol. Mass.:99185.27
Organism:Homo sapiens (Human)
Description:CHO cells were stably transfected with human AR gene.
Residue:920
BDBM18559
BDBM18161
NameBDBM18559
Synonyms:6-alkyl, 7-amino-2-quinolinone, 11a | 7-amino-6-methyl-4-(trifluoromethyl)-1,2-dihydroquinolin-2-one
TypeSmall organic molecule
Emp. Form.C11H9F3N2O
Mol. Mass.242.1972
SMILESCc1cc2c(cc(=O)[nH]c2cc1N)C(F)(F)F