Reaction Details
TargetAndrogen receptor
LigandBDBM18564
Substrate/CompetitorBDBM18161
Meas. Tech.AR Transcriptional Activation Assay and MDA Whole-Cell Binding Assay
Ki 650±n/a nM
IC50 301±n/a nM
Citation van Oeveren, APio, BATegley, CMHiguchi, RIWu, MJones, TKMarschke, KBNegro-Vilar, AZhi, L Discovery of an androgen receptor modulator pharmacophore based on 2-quinolinones. Bioorg Med Chem Lett17:1523-6 (2007) 
 
Androgen receptor
Name:Androgen receptor
Type:Receptor
Mol. Mass.:99185.27
Organism:Homo sapiens (Human)
Description:CHO cells were stably transfected with human AR gene.
Residue:920
BDBM18564
BDBM18161
NameBDBM18564
Synonyms:6-alkyl, 7-alkylamino-2-quinolinone, 11f | 6-methyl-7-[(2-methylpropyl)amino]-4-(trifluoromethyl)-1,2-dihydroquinolin-2-one
TypeSmall organic molecule
Emp. Form.C15H17F3N2O
Mol. Mass.298.3035
SMILESCC(C)CNc1cc2[nH]c(=O)cc(c2cc1C)C(F)(F)F