Reaction Details
TargetAndrogen receptor
LigandBDBM18566
Substrate/CompetitorBDBM18161
Meas. Tech.AR Transcriptional Activation Assay and MDA Whole-Cell Binding Assay
Ki 157±n/a nM
IC50 216±n/a nM
Citation van Oeveren, APio, BATegley, CMHiguchi, RIWu, MJones, TKMarschke, KBNegro-Vilar, AZhi, L Discovery of an androgen receptor modulator pharmacophore based on 2-quinolinones. Bioorg Med Chem Lett17:1523-6 (2007) 
 
Androgen receptor
Name:Androgen receptor
Type:Receptor
Mol. Mass.:99185.27
Organism:Homo sapiens (Human)
Description:CHO cells were stably transfected with human AR gene.
Residue:920
BDBM18566
BDBM18161
NameBDBM18566
Synonyms:6-alkyl, 7-alkylamino-2-quinolinone, 11h | 6-ethyl-7-[(2,2,2-trifluoroethyl)amino]-4-(trifluoromethyl)-1,2-dihydroquinolin-2-one
TypeSmall organic molecule
Emp. Form.C14H12F6N2O
Mol. Mass.338.2483
SMILESCCc1cc2c(cc(=O)[nH]c2cc1NCC(F)(F)F)C(F)(F)F