Reaction Details
TargetAndrogen receptor
LigandBDBM18573
Substrate/CompetitorBDBM18161
Meas. Tech.AR Transcriptional Activation Assay and MDA Whole-Cell Binding Assay
Ki 74±n/a nM
IC50 42±n/a nM
Citation van Oeveren, APio, BATegley, CMHiguchi, RIWu, MJones, TKMarschke, KBNegro-Vilar, AZhi, L Discovery of an androgen receptor modulator pharmacophore based on 2-quinolinones. Bioorg Med Chem Lett17:1523-6 (2007) 
 
Androgen receptor
Name:Androgen receptor
Type:Receptor
Mol. Mass.:99185.27
Organism:Homo sapiens (Human)
Description:CHO cells were stably transfected with human AR gene.
Residue:920
BDBM18573
BDBM18161
NameBDBM18573
Synonyms:6-(cyclopentylamino)-4-(trifluoromethyl)-1,2-dihydroquinolin-2-one | 6-alkylamino 2-quinolinone, 13e
TypeSmall organic molecule
Emp. Form.C15H15F3N2O
Mol. Mass.296.2876
SMILESFC(F)(F)c1cc(=O)[nH]c2ccc(NC3CCCC3)cc12