Reaction Details
TargetGlucocorticoid receptor
LigandBDBM18628
Substrate/CompetitorBDBM18207
Meas. Tech.Competitive Ligand Binding Assay, GR-Mediated Antagonist Activity Assay, and IL-6 Repression Assay
pH7.5±n/a
Temperature277.15±n/a K
Ki 1.4±0.2 nM
IC50 0.4±0.1 nM
EC50 0.3±0.1 nM
CommentsGRE activation antagonist mode efficacy is 97 +/- 0.5 %. It is a full GRE activation antagonist, which demonstrated reduced agonist activity in the TAT GRE activation assay in comparison to dexamethasone.
Citation Hudson, ARRoach, SLHiguchi, RIPhillips, DPBissonnette, RPLamph, WWYen, JLi, YAdams, MEValdez, LJVassar, ACuervo, CKallel, EAGharbaoui, CJMais, DEMiner, JNMarschke, KBRungta, DNegro-Vilar, AZhi, L Synthesis and characterization of nonsteroidal glucocorticoid receptor modulators for multiple myeloma. J Med Chem50:4699-709 (2007) 
 
Glucocorticoid receptor
Name:Glucocorticoid receptor
Type:Enzyme
Mol. Mass.:85656.87
Organism:Homo sapiens (Human)
Description:P04150
Residue:777
BDBM18628
BDBM18207
NameBDBM18628
Synonyms:(18Z)-12-methoxy-3,5,5-trimethyl-18-{[3-(2,2,2-trifluoro-1-hydroxyethyl)thiophen-2-yl]methylidene}-17-oxa-6-azatetracyclo[8.8.0.0^{2,7}.0^{11,16}]octadeca-1(10),2(7),3,8,11,13,15-heptaen-13-ol | secondary alcohol, 15
TypeSmall organic molecule
Emp. Form.C27H24F3NO4S
Mol. Mass.515.544
SMILESCOc1c(O)ccc2O\C(=C/c3sccc3C(O)C(F)(F)F)c3c(ccc4NC(C)(C)C=C(C)c34)-c12