Reaction Details
TargetApelin receptor
LigandBDBM269870
Substrate/Competitorn/a
Meas. Tech.[35S]GTPgammaS Binding Assay
EC50 30.0±n/a nM
Citation Chen, NChen, XChen, YCheng, ACConnors, RVDeignan, JDransfield, PJDu, XFu, ZHeath, JAHorne, DBHouze, JKaller, MRKhakoo, AYKopecky, DJLai, SMa, ZMcGee, LRMedina, JCMihalic, JTNishimura, NOlson, SHPattaropong, VSwaminath, GWang, XYang, KYeh, WDebenedetto, MVFarrell, RPHedley, SJJudd, TCKayser, F Triazole agonists of the APJ receptor US Patent US10221162 Publication Date 3/5/2019
 
Apelin receptor
Name:Apelin receptor
Type:Enzyme Catalytic Domain
Mol. Mass.:42664.06
Organism:Homo sapiens (Human)
Description:P35414
Residue:380
BDBM269870
NameBDBM269870
Synonyms:(1S,2R)—N-(4-(2,6-dimethoxyphenyl)-5-(5-methylpyridin-3-yl)-4H-1,2,4-triazol-3-yl)-1-(2-methoxyethoxy)-1-(5-methylpyrimidin-2-yl)propane-2-sulfonamide or (1R,2S)—N-(4-(2,6-dimethoxyphenyl)-5-(5-methylpyridin-3-yl)-4H-1,2,4-triazol-3-yl)-1-(2-methoxyethoxy)-1-(5-methylpyrimidin-2-yl)propane-2-sulfonamide US10221162, Example 397.0 | US9845310, Example 397.0
TypeSmall organic molecule
Emp. Form.C27H33N7O6S
Mol. Mass.583.659
SMILESCOCCO[C@H]([C@@H](C)S(=O)(=O)Nc1nnc(-c2cncc(C)c2)n1-c1c(OC)cccc1OC)c1ncc(C)cn1