Reaction Details
TargetBromodomain-containing protein 4
LigandBDBM50148549
Substrate/Competitorn/a
Meas. Tech.Alpha Screen competitive assay
pH7.4±n/a
Temperature298.15±n/a K
IC50>10000±n/a nM
Commentsextracted
Citation Meier, JCTallant, CFedorov, OWitwicka, HHwang, SYvan Stiphout, RGLambert, JPRogers, CYapp, CGerstenberger, BSFedele, VSavitsky, PHeidenreich, DDaniels, DLOwen, DRFish, PVIgoe, NMBayle, EDHaendler, BOppermann, UCTBuffa, FBrennan, PEMüller, SGingras, ACOdgren, PRBirnbaum, MJKnapp, S Selective Targeting of Bromodomains of the Bromodomain-PHD Fingers Family Impairs Osteoclast Differentiation. ACS Chem Biol12:2619-2630 (2017) 
 
Bromodomain-containing protein 4
Name:Bromodomain-containing protein 4
Type:Protein
Mol. Mass.:152264.84
Organism:Homo sapiens (Human)
Description:O60885
Residue:1362
BDBM50148549
NameBDBM50148549
Synonyms:4-Bromo-N-(2,3-dihydro-6-methoxy-1,3-dimethyl-2-oxo-1H-benzimidazol-5-yl)-2-methyl-benzenesulfonamide CHEMBL3770173 OF-1
TypeSmall organic molecule
Emp. Form.C17H18BrN3O4S
Mol. Mass.440.312
SMILESCOc1cc2n(C)c(=O)n(C)c2cc1NS(=O)(=O)c1ccc(Br)cc1C