Reaction Details
TargetBromodomain-containing protein 4
LigandBDBM50157570
Substrate/Competitorn/a
Meas. Tech.Alpha Screen competitive assay
pH7.4±n/a
Temperature298.15±n/a K
IC50>10000±n/a nM
Commentsextracted
Citation Meier, JCTallant, CFedorov, OWitwicka, HHwang, SYvan Stiphout, RGLambert, JPRogers, CYapp, CGerstenberger, BSFedele, VSavitsky, PHeidenreich, DDaniels, DLOwen, DRFish, PVIgoe, NMBayle, EDHaendler, BOppermann, UCTBuffa, FBrennan, PEMüller, SGingras, ACOdgren, PRBirnbaum, MJKnapp, S Selective Targeting of Bromodomains of the Bromodomain-PHD Fingers Family Impairs Osteoclast Differentiation. ACS Chem Biol12:2619-2630 (2017) 
 
Bromodomain-containing protein 4
Name:Bromodomain-containing protein 4
Type:Protein
Mol. Mass.:152264.84
Organism:Homo sapiens (Human)
Description:O60885
Residue:1362
BDBM50157570
NameBDBM50157570
Synonyms:4-cyano-N-(1,3-dimethyl-2-oxoquinolin-6-yl)-2-methoxybenzenesulfonamide D0O6XT NI 57 US11773085, Compound B26
TypeSmall organic molecule
Emp. Form.C19H17N3O4S
Mol. Mass.383.421
SMILESCOc1cc(ccc1S(=O)(=O)Nc1ccc2n(C)c(=O)c(C)cc2c1)C#N