Reaction Details
TargetInosine-5'-monophosphate dehydrogenase 2
LigandBDBM19264
Substrate/CompetitorBDBM19254
Meas. Tech.IMPDH2 Enzyme Inhibition and Human T-Lymphoblast (CEM) Proliferation Inhibition Assays
pH8±n/a
Temperature298.15±n/a K
IC50 16±1.1 nM
EC50 540±30 nM
Citation Watterson, SHChen, PZhao, YGu, HHDhar, TGXiao, ZBallentine, SKShen, ZFleener, CARouleau, KAObermeier, MYang, ZMcIntyre, KWShuster, DJWitmer, MDambach, DChao, SMathur, AChen, BCBarrish, JCRobl, JATownsend, RIwanowicz, EJ Acridone-based inhibitors of inosine 5'-monophosphate dehydrogenase: discovery and SAR leading to the identification of N-(2-(6-(4-ethylpiperazin-1-yl)pyridin-3-yl)propan-2-yl)-2- fluoro-9-oxo-9,10-dihydroacridine-3-carboxamide (BMS-566419). J Med Chem50:3730-42 (2007) 
 
Inosine-5'-monophosphate dehydrogenase 2
Name:Inosine-5'-monophosphate dehydrogenase 2
Type:Enzyme
Mol. Mass.:55806.87
Organism:Homo sapiens (Human)
Description:Recombinant IMPDH2 expressed in E. coli.
Residue:514
BDBM19264
BDBM19254
NameBDBM19264
Synonyms:(4E)-6-(4-hydroxy-6-methoxy-7-methyl-3-oxo-1,3-dihydro-2-benzofuran-5-yl)-4-methylhex-4-enoic acid CHEMBL866 Mycophenolic Acid (MPA) | Myfortic
TypeSmall organic molecule
Emp. Form.C17H20O6
Mol. Mass.320.3371
SMILESCOc1c(C)c2COC(=O)c2c(O)c1C\C=C(/C)CCC(O)=O