Reaction Details
TargetCathepsin K
LigandBDBM19782
Substrate/CompetitorBDBM19485
Meas. Tech.Enzyme Inhibition Assay
pH5.5±n/a
Temperature295.15±n/a K
IC50 7.5±n/a nM
Citation Barrett, DGCatalano, JGDeaton, DNLong, STMcFadyen, RBMiller, ABMiller, LRSamano, VTavares, FXWells-Knecht, KJWright, LLZhou, HQ Acyclic, orally bioavailable ketone-based cathepsin K inhibitors. Bioorg Med Chem Lett17:22-7 (2007) 
 
Cathepsin K
Name:Cathepsin K
Type:Enzyme
Mol. Mass.:36975.68
Organism:Homo sapiens (Human)
Description:P43235
Residue:329
BDBM19782
BDBM19485
NameBDBM19782
Synonyms:(2S)-2-(1-benzofuran-2-ylformamido)-4-methyl-N-[(2S)-3-oxo-4-(pyridine-2-sulfonamido)butan-2-yl]pentanamide ketone, 1
TypeSmall organic molecule
Emp. Form.C24H28N4O6S
Mol. Mass.500.567
SMILESCC(C)C[C@H](NC(=O)c1cc2ccccc2o1)C(=O)N[C@@H](C)C(=O)CNS(=O)(=O)c1ccccn1