Reaction Details
TargetTransient receptor potential cation channel subfamily V member 1
LigandBDBM20484
Substrate/CompetitorBDBM10852
Meas. Tech.FLIPR (Fluorescence Imaging Plate Reader)-Based Ca2+ Assay
pH7.2±n/a
Temperature298.15±n/a K
EC50 8±n/a nM
Citation Rami, HKThompson, MWyman, PJerman, JCEgerton, JBrough, SStevens, AJRandall, ADSmart, DGunthorpe, MJDavis, JB Discovery of small molecule antagonists of TRPV1. Bioorg Med Chem Lett14:3631-4 (2004) 
 
Transient receptor potential cation channel subfamily V member 1
Name:Transient receptor potential cation channel subfamily V member 1
Type:Protein
Mol. Mass.:94960.75
Organism:Homo sapiens (Human)
Description:Q8NER1
Residue:839
BDBM20484
BDBM10852
NameBDBM20484
Synonyms:1-(2-bromophenyl)-3-{2-[ethyl(4-methylphenyl)amino]ethyl}urea | urea TRPV1 antagonist, 17
TypeSmall organic molecule
Emp. Form.C18H22BrN3O
Mol. Mass.376.291
SMILESCCN(CCNC(=O)Nc1ccccc1Br)c1ccc(C)cc1