Reaction Details
TargetTranslocator protein
LigandBDBM22040
Substrate/CompetitorBDBM22032
Meas. Tech.Radioligand Binding Assay
pH7.4±n/a
Temperature277.15±n/a K
Ki 23±3.1 nM
Citation Taliani, SSimorini, FSergianni, VLa Motta, CDa Settimo, FCosimelli, BAbignente, EGreco, GNovellino, ERossi, LGremigni, VSpinetti, FChelli, BMartini, C New fluorescent 2-phenylindolglyoxylamide derivatives as probes targeting the peripheral-type benzodiazepine receptor: design, synthesis, and biological evaluation. J Med Chem50:404-7 (2007) 
 
Translocator protein
Name:Translocator protein
Type:Mitochondrion membrane protein
Mol. Mass.:18945.84
Organism:Rattus norvegicus (rat)
Description:Competitive binding experiments were performed on rat kidney mitochondrial membranes.
Residue:169
BDBM22040
BDBM22032
NameBDBM22040
Synonyms:4 -chlorodiazepam 7-chloro-5-(4-chlorophenyl)-1-methyl-1,3-dihydro-2H-1,4-benzodiazepin-2-one CHEMBL286346 Ro-05-4864 Ro5-4864
TypeSmall organic molecule
Emp. Form.C16H12Cl2N2O
Mol. Mass.319.185
SMILESCN1c2ccc(Cl)cc2C(=NCC1=O)c1ccc(Cl)cc1