Reaction Details
TargetD(1A) dopamine receptor
LigandBDBM371983
Substrate/Competitorn/a
Meas. Tech.In Vitro Binding Assay for DDR1
IC50 23.8±n/a nM
Citation Buettelmann, BKocer, BKuhn, BPrunotto, MRichter, HRitter, MRudolph, MSatz, AL Triaza-spirodecanones as DDR1 inhibitors US Patent US10239876 Publication Date 3/26/2019
 
D(1A) dopamine receptor
Name:D(1A) dopamine receptor
Type:Enzyme
Mol. Mass.:49303.43
Organism:Homo sapiens (Human)
Description:P21728
Residue:446
BDBM371983
NameBDBM371983
Synonyms:(RS)-3-[2-Oxo-2-[3-(trifluoromethyl)pyrrolidin-1-yl]ethyl]-1-phenyl-8-(1H-pyrazolo[3,4-b]pyridine-5-carbonyl)-1,3,8-triazaspiro[4.5]decan-4-one US10435407, Example 47
TypeSmall organic molecule
Emp. Form.C27H28F3N7O3
Mol. Mass.555.5515
SMILESFC(F)(F)C1CCN(C1)C(=O)CN1CN(c2ccccc2)C2(CCN(CC2)C(=O)c2cnc3[nH]ncc3c2)C1=O