Reaction Details
TargetD(1A) dopamine receptor
LigandBDBM372052
Substrate/Competitorn/a
Meas. Tech.In Vitro Binding Assay for DDR1
IC50 17.2±n/a nM
Citation Buettelmann, BKocer, BKuhn, BPrunotto, MRichter, HRitter, MRudolph, MSatz, AL Triaza-spirodecanones as DDR1 inhibitors US Patent US10239876 Publication Date 3/26/2019
 
D(1A) dopamine receptor
Name:D(1A) dopamine receptor
Type:Enzyme
Mol. Mass.:49303.43
Organism:Homo sapiens (Human)
Description:P21728
Residue:446
BDBM372052
NameBDBM372052
Synonyms:2-[4-Oxo-1-phenyl-8-(1H-pyrazolo[3,4-b]pyridine-5-carbonyl)-1,3,8-triazaspiro[4.5]decan-3-yl]-N-propan-2-yl-N-(2,2,2-trifluoroethyl)acetamide US10435407, Example 75
TypeSmall organic molecule
Emp. Form.C27H30F3N7O3
Mol. Mass.557.5674
SMILESCC(C)N(CC(F)(F)F)C(=O)CN1CN(c2ccccc2)C2(CCN(CC2)C(=O)c2cnc3[nH]ncc3c2)C1=O