Reaction Details
TargetD(1A) dopamine receptor
LigandBDBM372078
Substrate/Competitorn/a
Meas. Tech.In Vitro Binding Assay for DDR1
IC50 18.7±n/a nM
Citation Buettelmann, BKocer, BKuhn, BPrunotto, MRichter, HRitter, MRudolph, MSatz, AL Triaza-spirodecanones as DDR1 inhibitors US Patent US10239876 Publication Date 3/26/2019
 
D(1A) dopamine receptor
Name:D(1A) dopamine receptor
Type:Enzyme
Mol. Mass.:49303.43
Organism:Homo sapiens (Human)
Description:P21728
Residue:446
BDBM372078
NameBDBM372078
Synonyms:2-(8-(1H-Indazole-5-carbonyl)-4-oxo-1-phenyl-1,3,8-triazaspiro[4.5]decan-3-yl)-N-methyl-N-(2,2,2-trifluoroethyl)acetamide US10435407, Example 101
TypeSmall organic molecule
Emp. Form.C26H27F3N6O3
Mol. Mass.528.5262
SMILESCN(CC(F)(F)F)C(=O)CN1CN(c2ccccc2)C2(CCN(CC2)C(=O)c2ccc3[nH]ncc3c2)C1=O