Reaction Details
TargetD(1A) dopamine receptor
LigandBDBM372081
Substrate/Competitorn/a
Meas. Tech.In Vitro Binding Assay for DDR1
IC50 21.0±n/a nM
Citation Buettelmann, BKocer, BKuhn, BPrunotto, MRichter, HRitter, MRudolph, MSatz, AL Triaza-spirodecanones as DDR1 inhibitors US Patent US10239876 Publication Date 3/26/2019
 
D(1A) dopamine receptor
Name:D(1A) dopamine receptor
Type:Enzyme
Mol. Mass.:49303.43
Organism:Homo sapiens (Human)
Description:P21728
Residue:446
BDBM372081
NameBDBM372081
Synonyms:2-(8-(3-Amino-1H-indazole-5-carbonyl)-4-oxo-1-phenyl-1,3,8-triazaspiro[4.5]decan-3-yl)-N-(2,2,2-trifluoroethyl)acetamide US10435407, Example 104
TypeSmall organic molecule
Emp. Form.C25H26F3N7O3
Mol. Mass.529.5142
SMILESNc1n[nH]c2ccc(cc12)C(=O)N1CCC2(CC1)N(CN(CC(=O)NCC(F)(F)F)C2=O)c1ccccc1