Reaction Details
TargetD(1A) dopamine receptor
LigandBDBM372110
Substrate/Competitorn/a
Meas. Tech.In Vitro Binding Assay for DDR1
IC50 19.3±n/a nM
Citation Buettelmann, BKocer, BKuhn, BPrunotto, MRichter, HRitter, MRudolph, MSatz, AL Triaza-spirodecanones as DDR1 inhibitors US Patent US10239876 Publication Date 3/26/2019
 
D(1A) dopamine receptor
Name:D(1A) dopamine receptor
Type:Enzyme
Mol. Mass.:49303.43
Organism:Homo sapiens (Human)
Description:P21728
Residue:446
BDBM372110
NameBDBM372110
Synonyms:8-(1H-Indazole-5-carbonyl)-3-[2-[4-methyl-3-(trifluoromethyl)piperazin-1-yl]-2-oxoethyl]-1-phenyl-1,3,8-triazaspiro[4.5]decan-4-one US10435407, Example 133
TypeSmall organic molecule
Emp. Form.C29H32F3N7O3
Mol. Mass.583.6047
SMILESCN1CCN(CC1C(F)(F)F)C(=O)CN1CN(c2ccccc2)C2(CCN(CC2)C(=O)c2ccc3[nH]ncc3c2)C1=O