Reaction Details
TargetD(1A) dopamine receptor
LigandBDBM372137
Substrate/Competitorn/a
Meas. Tech.In Vitro Binding Assay for DDR1
IC50 33.2±n/a nM
Citation Buettelmann, BKocer, BKuhn, BPrunotto, MRichter, HRitter, MRudolph, MSatz, AL Triaza-spirodecanones as DDR1 inhibitors US Patent US10239876 Publication Date 3/26/2019
 
D(1A) dopamine receptor
Name:D(1A) dopamine receptor
Type:Enzyme
Mol. Mass.:49303.43
Organism:Homo sapiens (Human)
Description:P21728
Residue:446
BDBM372137
NameBDBM372137
Synonyms:N-(2-cyanopropan-2-yl)-2-[8-(1H-indazole-5-carbonyl)-4-oxo-1-phenyl-1,3,8-triazaspiro[4.5]decan-3-yl]acetamide US10435407, Example 160
TypeSmall organic molecule
Emp. Form.C27H29N7O3
Mol. Mass.499.5643
SMILESCC(C)(NC(=O)CN1CN(c2ccccc2)C2(CCN(CC2)C(=O)c2ccc3[nH]ncc3c2)C1=O)C#N