Reaction Details
TargetPolyunsaturated fatty acid lipoxygenase ALOX15
LigandBDBM22232
Substrate/CompetitorBDBM22231
Meas. Tech.Enzyme Inhibition Assay
IC50 33±n/a nM
Citation Weinstein, DSLiu, WNgu, KLangevine, CCombs, DWZhuang, SChen, CMadsen, CSHarper, TWRobl, JA Discovery of selective imidazole-based inhibitors of mammalian 15-lipoxygenase: highly potent against human enzyme within a cellular environment. Bioorg Med Chem Lett17:5115-20 (2007) 
 
Polyunsaturated fatty acid lipoxygenase ALOX15
Name:Polyunsaturated fatty acid lipoxygenase ALOX15
Type:Enzyme
Mol. Mass.:75309.71
Organism:Oryctolagus cuniculus (rabbit)
Description:15-LO enzyme was purified from phenylhydrazine treated rabbits.
Residue:663
BDBM22232
BDBM22231
NameBDBM22232
Synonyms:2,4,5-tri-substituted imidazole, 6a | N-[2-(2,5-diphenyl-1H-imidazol-4-yl)ethyl]-4-pentylbenzene-1-sulfonamide
TypeSmall organic molecule
Emp. Form.C28H31N3O2S
Mol. Mass.473.63
SMILESCCCCCc1ccc(cc1)S(=O)(=O)NCCc1[nH]c(nc1-c1ccccc1)-c1ccccc1