Reaction Details
TargetPolyunsaturated fatty acid lipoxygenase ALOX15
LigandBDBM22249
Substrate/CompetitorBDBM22231
Meas. Tech.Enzyme Inhibition Assay
IC50 6±n/a nM
Citation Weinstein, DSLiu, WNgu, KLangevine, CCombs, DWZhuang, SChen, CMadsen, CSHarper, TWRobl, JA Discovery of selective imidazole-based inhibitors of mammalian 15-lipoxygenase: highly potent against human enzyme within a cellular environment. Bioorg Med Chem Lett17:5115-20 (2007) 
 
Polyunsaturated fatty acid lipoxygenase ALOX15
Name:Polyunsaturated fatty acid lipoxygenase ALOX15
Type:Enzyme
Mol. Mass.:75309.71
Organism:Oryctolagus cuniculus (rabbit)
Description:15-LO enzyme was purified from phenylhydrazine treated rabbits.
Residue:663
BDBM22249
BDBM22231
NameBDBM22249
Synonyms:2,4,5-tri-substituted imidazole, 14n | N-{2-[5-(4-methoxyphenyl)-2-(thiophen-2-yl)-1H-imidazol-4-yl]ethyl}-4-pentylbenzene-1-sulfonamide
TypeSmall organic molecule
Emp. Form.C27H31N3O3S2
Mol. Mass.509.683
SMILESCCCCCc1ccc(cc1)S(=O)(=O)NCCc1[nH]c(nc1-c1ccc(OC)cc1)-c1cccs1