Reaction Details
TargetPolyunsaturated fatty acid lipoxygenase ALOX15
LigandBDBM22261
Substrate/CompetitorBDBM22231
Meas. Tech.Enzyme Inhibition Assay
IC50 31±n/a nM
Citation Weinstein, DSLiu, WNgu, KLangevine, CCombs, DWZhuang, SChen, CMadsen, CSHarper, TWRobl, JA Discovery of selective imidazole-based inhibitors of mammalian 15-lipoxygenase: highly potent against human enzyme within a cellular environment. Bioorg Med Chem Lett17:5115-20 (2007) 
 
Polyunsaturated fatty acid lipoxygenase ALOX15
Name:Polyunsaturated fatty acid lipoxygenase ALOX15
Type:Enzyme
Mol. Mass.:75309.71
Organism:Oryctolagus cuniculus (rabbit)
Description:15-LO enzyme was purified from phenylhydrazine treated rabbits.
Residue:663
BDBM22261
BDBM22231
NameBDBM22261
Synonyms:2,4,5-tri-substituted imidazole, 21i | {[(3R)-1-benzylpyrrolidin-3-yl](methyl)sulfamoyl}({2-[5-(4-methoxyphenyl)-2-phenyl-1H-imidazol-4-yl]ethyl})amine
TypeSmall organic molecule
Emp. Form.C30H35N5O3S
Mol. Mass.545.696
SMILES[H][C@]1(CCN(Cc2ccccc2)C1)N(C)S(=O)(=O)NCCc1[nH]c(nc1-c1ccc(OC)cc1)-c1ccccc1