Reaction Details
TargetPolyunsaturated fatty acid lipoxygenase ALOX15
LigandBDBM22264
Substrate/CompetitorBDBM22231
Meas. Tech.Enzyme Inhibition Assay
IC50 11±n/a nM
Citation Weinstein, DSLiu, WNgu, KLangevine, CCombs, DWZhuang, SChen, CMadsen, CSHarper, TWRobl, JA Discovery of selective imidazole-based inhibitors of mammalian 15-lipoxygenase: highly potent against human enzyme within a cellular environment. Bioorg Med Chem Lett17:5115-20 (2007) 
 
Polyunsaturated fatty acid lipoxygenase ALOX15
Name:Polyunsaturated fatty acid lipoxygenase ALOX15
Type:Enzyme
Mol. Mass.:75309.71
Organism:Oryctolagus cuniculus (rabbit)
Description:15-LO enzyme was purified from phenylhydrazine treated rabbits.
Residue:663
BDBM22264
BDBM22231
NameBDBM22264
Synonyms:2,4,5-tri-substituted imidazole, 21l | {[(3R)-1-(3,4-dichlorophenyl)pyrrolidin-3-yl](methyl)sulfamoyl}({2-[5-(4-methoxyphenyl)-2-(thiophen-2-yl)-1H-imidazol-4-yl]ethyl})amine
TypeSmall organic molecule
Emp. Form.C27H29Cl2N5O3S2
Mol. Mass.606.587
SMILES[H][C@]1(CCN(C1)c1ccc(Cl)c(Cl)c1)N(C)S(=O)(=O)NCCc1[nH]c(nc1-c1ccc(OC)cc1)-c1cccs1