Reaction Details
TargetHistamine H3 receptor
LigandBDBM22529
Substrate/CompetitorBDBM22530
Meas. Tech.Radioligand Binding Assay and Functional [35S]GTP-gamma-S Binding Assay
pH7.4±n/a
Temperature298.15±n/a K
Ki 4±0.1 nM
EC50 16±9 nM
Citation Wijtmans, MCelanire, SSnip, EGillard, MRGelens, ECollart, PPVenhuis, BJChristophe, BHulscher, Svan der Goot, HLebon, FTimmerman, HBakker, RALallemand, BILeurs, RTalaga, PEde Esch, IJ 4-benzyl-1H-imidazoles with oxazoline termini as histamine H3 receptor agonists. J Med Chem51:2944-53 (2008) 
 
Histamine H3 receptor
Name:Histamine H3 receptor
Type:G Protein-Coupled Receptor (GPCR)
Mol. Mass.:48691.47
Organism:Homo sapiens (Human)
Description:Binding assays were using CHO cells stably expressing hH3R receptors.
Residue:445
BDBM22529
BDBM22530
NameBDBM22529
Synonyms:2-[3-(1H-imidazol-4-ylmethyl)phenyl]-4,4-dimethyl-4,5-dihydro-1,3-oxazole | 4-Benzyl-1H-imidazole derivative, 10
TypeSmall organic molecule
Emp. Form.C15H17N3O
Mol. Mass.255.315
SMILESCC1(C)COC(=N1)c1cccc(Cc2cnc[nH]2)c1