Reaction Details
TargetHistamine H3 receptor
LigandBDBM22534
Substrate/CompetitorBDBM22530
Meas. Tech.H3R Radioligand Binding Assay
pH7.4±n/a
Temperature298.15±n/a K
Ki 41±2 nM
Citation Wijtmans, MCelanire, SSnip, EGillard, MRGelens, ECollart, PPVenhuis, BJChristophe, BHulscher, Svan der Goot, HLebon, FTimmerman, HBakker, RALallemand, BILeurs, RTalaga, PEde Esch, IJ 4-benzyl-1H-imidazoles with oxazoline termini as histamine H3 receptor agonists. J Med Chem51:2944-53 (2008) 
 
Histamine H3 receptor
Name:Histamine H3 receptor
Type:G Protein-Coupled Receptor (GPCR)
Mol. Mass.:48691.47
Organism:Homo sapiens (Human)
Description:Binding assays were using CHO cells stably expressing hH3R receptors.
Residue:445
BDBM22534
BDBM22530
NameBDBM22534
Synonyms:2-[3-(1H-imidazol-4-ylmethyl)phenyl]pyridine | 4-Benzyl-1H-imidazole derivative, 15
TypeSmall organic molecule
Emp. Form.C15H13N3
Mol. Mass.235.2838
SMILESC(c1cnc[nH]1)c1cccc(c1)-c1ccccn1