Reaction Details
TargetHistamine H3 receptor
LigandBDBM22545
Substrate/CompetitorBDBM22530
Meas. Tech.Radioligand Binding Assay and Functional [35S]GTP-gamma-S Binding Assay
pH7.4±n/a
Temperature298.15±n/a K
Ki 417±19 nM
EC50 631±239 nM
Citation Wijtmans, MCelanire, SSnip, EGillard, MRGelens, ECollart, PPVenhuis, BJChristophe, BHulscher, Svan der Goot, HLebon, FTimmerman, HBakker, RALallemand, BILeurs, RTalaga, PEde Esch, IJ 4-benzyl-1H-imidazoles with oxazoline termini as histamine H3 receptor agonists. J Med Chem51:2944-53 (2008) 
 
Histamine H3 receptor
Name:Histamine H3 receptor
Type:G Protein-Coupled Receptor (GPCR)
Mol. Mass.:48691.47
Organism:Homo sapiens (Human)
Description:Binding assays were using CHO cells stably expressing hH3R receptors.
Residue:445
BDBM22545
BDBM22530
NameBDBM22545
Synonyms:4-Benzyl-1H-imidazole derivative, 23 | 4-[(4-bromophenyl)methyl]-1H-imidazole
TypeSmall organic molecule
Emp. Form.C10H9BrN2
Mol. Mass.237.096
SMILESBrc1ccc(Cc2cnc[nH]2)cc1