Reaction Details
TargetHistamine H3 receptor
LigandBDBM22550
Substrate/CompetitorBDBM22530
Meas. Tech.H3R Radioligand Binding Assay
pH7.4±n/a
Temperature298.15±n/a K
Ki 56±6 nM
Citation Wijtmans, MCelanire, SSnip, EGillard, MRGelens, ECollart, PPVenhuis, BJChristophe, BHulscher, Svan der Goot, HLebon, FTimmerman, HBakker, RALallemand, BILeurs, RTalaga, PEde Esch, IJ 4-benzyl-1H-imidazoles with oxazoline termini as histamine H3 receptor agonists. J Med Chem51:2944-53 (2008) 
 
Histamine H3 receptor
Name:Histamine H3 receptor
Type:G Protein-Coupled Receptor (GPCR)
Mol. Mass.:48691.47
Organism:Homo sapiens (Human)
Description:Binding assays were using CHO cells stably expressing hH3R receptors.
Residue:445
BDBM22550
BDBM22530
NameBDBM22550
Synonyms:2-[3-(1H-imidazol-4-ylmethyl)phenyl]-1-oxa-3-azaspiro[4.5]dec-2-ene | 4-Benzyl-1H-imidazole derivative, 28
TypeSmall organic molecule
Emp. Form.C18H21N3O
Mol. Mass.295.3788
SMILESC(c1cnc[nH]1)c1cccc(c1)C1=NCC2(CCCCC2)O1