Reaction Details
TargetDNA ligase 1
LigandBDBM23049
Substrate/CompetitorBDBM23028
Meas. Tech.FAAH Inhibition Assay
pH9±n/a
Temperature295.15±n/a K
Ki 4.2±0.3 nM
IC50 10±n/a nM
Citation Hardouin, CKelso, MJRomero, FARayl, TJLeung, DHwang, ICravatt, BFBoger, DL Structure-activity relationships of alpha-ketooxazole inhibitors of fatty acid amide hydrolase. J Med Chem50:3359-68 (2007) 
 
DNA ligase 1
Name:DNA ligase 1
Type:Enzyme
Mol. Mass.:101721.76
Organism:Homo sapiens (Human)
Description:n/a
Residue:919
BDBM23049
BDBM23028
NameBDBM23049
Synonyms:7-[3-(methylsulfanyl)phenyl]-1-[5-(pyridin-2-yl)-1,3-oxazol-2-yl]heptan-1-one | alpha-ketooxazole, 5u
TypeSmall organic molecule
Emp. Form.C22H24N2O2S
Mol. Mass.380.503
SMILESCSc1cccc(CCCCCCC(=O)c2ncc(o2)-c2ccccn2)c1