Reaction Details
TargetD-amino-acid oxidase
LigandBDBM23179
Substrate/CompetitorBDBM23167
Meas. Tech.In vitro D-Amino Acid Oxidase Assay
pH8.5±n/a
Temperature295.15±n/a K
IC50 5000±240 nM
Citation Ferraris, DDuvall, BKo, YSThomas, AGRojas, CMajer, PHashimoto, KTsukamoto, T Synthesis and Biological Evaluation of d-Amino Acid Oxidase Inhibitors. J Med Chem51:3357-9 (2008) 
 
D-amino-acid oxidase
Name:D-amino-acid oxidase
Type:Flavoprotein
Mol. Mass.:39338.01
Organism:Sus scrofa (pig)
Description:Homodimer.
Residue:347
BDBM23179
BDBM23167
NameBDBM23179
Synonyms:6-(trifluoromethyl)-1,2-benzoxazol-3-ol | Benzo[d]isoxazol-3-ol Derivative, 3k
TypeSmall organic molecule
Emp. Form.C8H4F3NO2
Mol. Mass.203.1181
SMILESFC(F)(F)c1ccc2c(c1)o[nH]c2=O