Reaction Details
TargetSodium channel protein type 9 subunit alpha
LigandBDBM70816
Substrate/Competitorn/a
Meas. Tech.Radioligand Binding Assay
pH7.4±n/a
Temperature298.15±n/a K
IC50 0.9±n/a nM
Commentsextracted
Citation Andrez, JBichler, PRChen, CChowdhury, SDecker, SMDehnhardt, CMFocken, TGrimwood, MEHemeon, IWJia, QLi, JLiu, ZOrtwine, DFSafina, BSutherlin, DSheng, TSun, SWhite, ADWilson, MSZenova, AYZhu, J Substituted benzamides and methods of use thereof US Patent US9694002 Publication Date 7/4/2017
 
Sodium channel protein type 9 subunit alpha
Name:Sodium channel protein type 9 subunit alpha
Type:Protein
Mol. Mass.:226375.97
Organism:Homo sapiens (Human)
Description:Q15858
Residue:1988
BDBM70816
NameBDBM70816
Synonyms:US9546164, 4 | US9694002, 6
TypeSmall organic molecule
Emp. Form.C25H28ClF2N3O4S
Mol. Mass.540.022
SMILESFc1ccc(CN2CCC[C@H](C2)Oc2cc(F)c(cc2C2CC2)C(=O)NS(=O)(=O)N2CCC2)c(Cl)c1