Reaction Details
TargetSodium channel protein type 9 subunit alpha
LigandBDBM71211
Substrate/Competitorn/a
Meas. Tech.Radioligand Binding Assay
pH7.4±n/a
Temperature298.15±n/a K
IC50<1.0±n/a nM
Commentsextracted
Citation Andrez, JBichler, PRChen, CChowdhury, SDecker, SMDehnhardt, CMFocken, TGrimwood, MEHemeon, IWJia, QLi, JLiu, ZOrtwine, DFSafina, BSutherlin, DSheng, TSun, SWhite, ADWilson, MSZenova, AYZhu, J Substituted benzamides and methods of use thereof US Patent US9694002 Publication Date 7/4/2017
 
Sodium channel protein type 9 subunit alpha
Name:Sodium channel protein type 9 subunit alpha
Type:Protein
Mol. Mass.:226375.97
Organism:Homo sapiens (Human)
Description:Q15858
Residue:1988
BDBM71211
NameBDBM71211
Synonyms:US9546164, 312 | US9694002, 312
TypeSmall organic molecule
Emp. Form.C23H25ClF2N2O4S
Mol. Mass.498.97
SMILESCS(=O)(=O)NC(=O)c1cc(C2CC2)c(O[C@@H]2CCCN(Cc3ccc(F)cc3Cl)C2)cc1F