Reaction Details
TargetSodium channel protein type 1/10/11/2/3/4/5/8/9 subunit alpha
LigandBDBM71328
Substrate/Competitorn/a
Meas. Tech.Radioligand Binding Assay
pH7.4±n/a
Temperature298.15±n/a K
IC50 2.1±n/a nM
Commentsextracted
Citation Andrez, JBichler, PRChen, CChowdhury, SDecker, SMDehnhardt, CMFocken, TGrimwood, MEHemeon, IWJia, QLi, JLiu, ZOrtwine, DFSafina, BSutherlin, DSheng, TSun, SWhite, ADWilson, MSZenova, AYZhu, J Substituted benzamides and methods of use thereof US Patent US9694002 Publication Date 7/4/2017
 
Sodium channel protein type 1/10/11/2/3/4/5/8/9 subunit alpha
Name:Sodium channel protein type 1/10/11/2/3/4/5/8/9 subunit alpha
Synonyms:Sodium Channel Complex
Type:Protein Complex
Mol. Mass.:n/a
Description:n/a
Components:This complex has 9 components.
Component 1
Name:Sodium channel protein type 1 subunit alpha
Type:Protein
Mol. Mass.:228952.47
Organism:Homo sapiens (Human)
Description:P35498
Residue:2009
Component 2
Name:Sodium channel protein type 2 subunit alpha
Synonyms:HBSC II SCN2A SCN2A2 Sodium (Site 2) Sodium channel protein type 2 alpha subunit Voltage-gated sodium channel subunit alpha Nav1.2
Type:Enzyme
Mol. Mass.:227954.68
Organism:Homo sapiens (Human)
Description:Q99250
Residue:2005
Component 3
Name:Sodium channel protein type 3 subunit alpha
Synonyms:KIAA1356 NAC3 SCN3A_HUMAN Sodium channel alpha subunits; brain (Types I, II, III) Voltage-gated sodium channel subunit alpha Nav1.3 (Nav1.3)
Type:Protein
Mol. Mass.:226276.42
Organism:Homo sapiens (Human)
Description:Q9NY46
Residue:2000
Component 4
Name:Sodium channel protein type 4 subunit alpha
Synonyms:SCN4A SkM1 Sodium channel protein skeletal muscle subunit alpha Sodium channel protein type IV alpha subunit Voltage-gated sodium channel subunit alpha Nav1.4 | Voltage-gated sodium channel subunit alpha Nav1.4 (Nav1.4)
Type:Protein
Mol. Mass.:208010.01
Organism:Homo sapiens (Human)
Description:P35499
Residue:1836
Component 5
Name:Sodium channel protein type 5 subunit alpha
Synonyms:HH1 SCN5A_HUMAN Sodium channel protein type 5 subunit alpha/beta-1/beta-2 Voltage-gated sodium channel subunit alpha Nav1.5
Type:Enzyme
Mol. Mass.:226908.60
Organism:Homo sapiens (Human)
Description:Q14524
Residue:2016
Component 6
Name:Sodium channel protein type 8 subunit alpha
Synonyms:MED SCN8A_HUMAN Sodium channel protein type 8 subunit alpha Voltage-gated sodium channel subunit alpha Nav1.6 | ep nav1.6
Type:PROTEIN
Mol. Mass.:225271.59
Organism:Homo sapiens (Human)
Description:ChEMBL_1516902
Residue:1980
Component 7
Name:Sodium channel protein type 9 subunit alpha
Synonyms:NENA Peripheral sodium channel 1 SCN9A_HUMAN Voltage-gated sodium channel subunit Nav1.7 hNE-Na
Type:Protein
Mol. Mass.:226375.97
Organism:Homo sapiens (Human)
Description:Q15858
Residue:1988
Component 8
Name:Sodium channel protein type 10 subunit alpha
Synonyms:PN3 SCN10A Sodium channel alpha subunit Sodium channel protein type X alpha subunit fret-membrane potential nav1.8 | hPN3
Type:Enzyme
Mol. Mass.:220609.21
Organism:Homo sapiens (Human)
Description:Q9Y5Y9
Residue:1956
Component 9
Name:Sodium channel protein type 11 subunit alpha
Synonyms:SCN11A SCNBA_HUMAN Sodium channel protein type XI alpha subunit
Type:PROTEIN
Mol. Mass.:204946.61
Organism:Homo sapiens (Human)
Description:ChEMBL_938850
Residue:1791
BDBM71328
NameBDBM71328
Synonyms:US9546164, 400 | US9694002, 400
TypeSmall organic molecule
Emp. Form.C32H33Cl2FN2O4S
Mol. Mass.631.585
SMILESFc1cc(OCC2CCN(CC2)C(c2ccc(Cl)cc2)c2ccc(Cl)cc2)c(cc1C(=O)NS(=O)(=O)C1CC1)C1CC1